{"text_format":"1","workbook":"xlsx","n_sheets":6,"sheets":["Read Me","Year 1 (rename)","Year 2 (rename)","Year 3 (rename)","Year 4 (rename)","Record Summary"],"not_rendered":{"charts":0,"images":0,"macros":0,"external_links":0,"defined_names":0,"comments":0,"pivot_tables":0},"unopened":[],"bounds":{"document_bytes":16777216,"sheet_cells":100000,"rows_first":2000,"rows_last":500,"rows_between":2000,"halvings":0,"cell_chars":16384,"cell_head_chars":4096},"cells_cut":0,"cells_raw":0,"read":"whole","date_system":"1900"}

{"sheet":"Read Me","index":0,"n_rows":32,"n_cols":2,"rows_kept":32,"cut":false,"hidden":false,"merged":[]}
[null,"EFFLUENT APPLICATION RECORD"]
[null,"A paddock-by-paddock traceability record for farm dairy effluent  ·  white-label template"]
[]
[null,"IMPORTANT — SET UP YOUR PADDOCKS FIRST (before entering any effluent records)"]
[null,"STEP 1: Open the “Record Summary” tab and replace the example paddocks in column A with your own paddock names or numbers — one per row. Do this before using any season tab, because these paddocks feed the dropdown list used for recording applications."]
[null,"2.  On each season tab, rename the tab to your actual season (for example 2025-2026), and fill in your farm name and resource consent number in the header row."]
[]
[null,"HOW TO USE IT (every application)"]
[null,"1.  Go to your current season tab."]
[null,"2.  In the next empty row, type the Start Date of the block. The End Date and Year fill in automatically (10-day block). You can type over the End Date if your block is a different length."]
[null,"3.  Pick the paddock you applied to from the dropdown in the Paddock column."]
[null,"4.  When you do a bucket test, type the measured depth (mm) in the Calibration column."]
[null,"5.  When you do the monthly maintenance, type “Check” in the last column."]
[null,"6.  That is it. Nothing else is required."]
[]
[null,"WHAT THIS IS"]
[null,"A record of where farm dairy effluent was applied, when, with calibration (bucket test) and monthly maintenance checks logged. It keeps a permanent, legible, backed-up log that exports cleanly if your council ever asks to see your records."]
[]
[null,"WHAT THIS IS NOT"]
[null,"This is a RECORD of what was done. It is NOT compliance advice. It does not tell you where you may or may not apply, how much, or whether anything is legal. It does not check any rule for you."]
[null,"The structure is modelled on a record format that an NZ regional council accepted for one farm’s consent. That does not mean your council will accept it, or that it meets the conditions of your consent. Effluent rules differ by region — in some regions discharge to land needs a resource consent, in others it is a permitted activity with set limits."]
[null,"You, the consent holder, remain responsible for meeting every condition of your own consent and every applicable regional rule. Before you rely on this, read your signed consent and confirm the record format with your regional council."]
[]
[null,"THE PADDOCK DROPDOWN"]
[null,"The dropdown list of paddocks on each season tab is built from the Paddock List on the “Record Summary” tab (column A). To add a new paddock, type it into that list and it will appear in the dropdowns."]
[]
[null,"PRINTING"]
[null,"Each tab has a print area set and is scaled to fit the page width. Season tabs print in landscape. File → Print will give you a clean paper copy."]
[]
[null,"—"]
[null,"Template supplied by [ your name / link here ] · free to use and adapt · remove this line if you prefer."]
[null,"Every value in this workbook is entered by you. No amounts, limits or paddocks are pre-filled or suggested."]

{"sheet":"Year 1 (rename)","index":1,"n_rows":150,"n_cols":6,"rows_kept":150,"cut":false,"hidden":false,"merged":[[0,5,1,5]]}
["Farm name:","[ your farm name ]",null,"Resource consent:","[ your consent no. ]","BEFORE USING THIS SHEET:\nSet up your paddocks first on the “Record Summary” tab."]
["Season:","[ e.g. 2025-2026 ]"]
["Start Date","End Date","Paddock","Year","Calibration (Bucket Test) mm","Maintenance each month (waterblasted, greased, line couplings checked)"]
[null,{"$f":"IF($A4=\"\",\"\",$A4+9)","v":""},"Example Paddock 1",{"$f":"IF($A4=\"\",\"\",YEAR($A4))","v":""}]
[null,"",null,""]
[null,"",null,""]
[null,"",null,""]
[null,"",null,""]
[null,"",null,""]
[null,"",null,""]
[null,"",null,""]
[null,"",null,""]
[null,"",null,""]
[null,"",null,""]
[null,"",null,""]
[null,"",null,""]
[null,"",null,""]
[null,"",null,""]
[null,"",null,""]
[null,"",null,""]
[null,"",null,""]
[null,"",null,""]
[null,"",null,""]
[null,"",null,""]
[null,"",null,""]
[null,"",null,""]
[null,"",null,""]
[null,"",null,""]
[null,"",null,""]
[null,"",null,""]
[null,"",null,""]
[null,"",null,""]
[null,"",null,""]
[null,"",null,""]
[null,"",null,""]
[null,"",null,""]
[null,"",null,""]
[null,"",null,""]
[null,"",null,""]
[null,"",null,""]
[null,"",null,""]
[null,"",null,""]
[null,"",null,""]
[null,"",null,""]
[null,"",null,""]
[null,"",null,""]
[null,"",null,""]
[null,"",null,""]
[null,"",null,""]
[null,"",null,""]
[null,"",null,""]
[null,"",null,""]
[null,"",null,""]
[null,"",null,""]
[null,"",null,""]
[null,"",null,""]
[null,"",null,""]
[null,"",null,""]
[null,"",null,""]
[null,"",null,""]
{"$rows_left_out":91}
{"sheet":"Year 2 (rename)","index":2,"n_rows":150,"n_cols":6,"rows_kept":150,"cut":false,"hidden":false,"merged":[[0,5,1,5]]}
["Farm name:","[ your farm name ]",null,"Resource consent:","[ your consent no. ]","BEFORE USING THIS SHEET:\nSet up your paddocks first on the “Record Summary” tab."]
["Season:","[ e.g. 2025-2026 ]"]
["Start Date","End Date","Paddock","Year","Calibration (Bucket Test) mm","Maintenance each month (waterblasted, greased, line couplings checked)"]
[null,{"$f":"IF($A4=\"\",\"\",$A4+9)","v":""},null,{"$f":"IF($A4=\"\",\"\",YEAR($A4))","v":""}]
[null,"",null,""]
[null,"",null,""]
[null,"",null,""]
[null,"",null,""]
[null,"",null,""]
[null,"",null,""]
[null,"",null,""]
[null,"",null,""]
[null,"",null,""]
[null,"",null,""]
[null,"",null,""]
[null,"",null,""]
[null,"",null,""]
[null,"",null,""]
[null,"",null,""]
[null,"",null,""]
[null,"",null,""]
[null,"",null,""]
[null,"",null,""]
[null,"",null,""]
[null,"",null,""]
[null,"",null,""]
[null,"",null,""]
[null,"",null,""]
[null,"",null,""]
[null,"",null,""]
[null,"",null,""]
[null,"",null,""]
[null,"",null,""]
[null,"",null,""]
[null,"",null,""]
[null,"",null,""]
[null,"",null,""]
[null,"",null,""]
[null,"",null,""]
[null,"",null,""]
[null,"",null,""]
[null,"",null,""]
[null,"",null,""]
[null,"",null,""]
[null,"",null,""]
[null,"",null,""]
[null,"",null,""]
[null,"",null,""]
[null,"",null,""]
[null,"",null,""]
[null,"",null,""]
[null,"",null,""]
[null,"",null,""]
[null,"",null,""]
[null,"",null,""]
[null,"",null,""]
[null,"",null,""]
[null,"",null,""]
[null,"",null,""]
[null,"",null,""]
{"$rows_left_out":91}
{"sheet":"Year 3 (rename)","index":3,"n_rows":150,"n_cols":6,"rows_kept":150,"cut":false,"hidden":false,"merged":[[0,5,1,5]]}
["Farm name:","[ your farm name ]",null,"Resource consent:","[ your consent no. ]","BEFORE USING THIS SHEET:\nSet up your paddocks first on the “Record Summary” tab."]
["Season:","[ e.g. 2025-2026 ]"]
["Start Date","End Date","Paddock","Year","Calibration (Bucket Test) mm","Maintenance each month (waterblasted, greased, line couplings checked)"]
[null,{"$f":"IF($A4=\"\",\"\",$A4+9)","v":""},null,{"$f":"IF($A4=\"\",\"\",YEAR($A4))","v":""}]
[null,"",null,""]
[null,"",null,""]
[null,"",null,""]
[null,"",null,""]
[null,"",null,""]
[null,"",null,""]
[null,"",null,""]
[null,"",null,""]
[null,"",null,""]
[null,"",null,""]
[null,"",null,""]
[null,"",null,""]
[null,"",null,""]
[null,"",null,""]
[null,"",null,""]
[null,"",null,""]
[null,"",null,""]
[null,"",null,""]
[null,"",null,""]
[null,"",null,""]
[null,"",null,""]
[null,"",null,""]
[null,"",null,""]
[null,"",null,""]
[null,"",null,""]
[null,"",null,""]
[null,"",null,""]
[null,"",null,""]
[null,"",null,""]
[null,"",null,""]
[null,"",null,""]
[null,"",null,""]
[null,"",null,""]
[null,"",null,""]
[null,"",null,""]
[null,"",null,""]
[null,"",null,""]
[null,"",null,""]
[null,"",null,""]
[null,"",null,""]
[null,"",null,""]
[null,"",null,""]
[null,"",null,""]
[null,"",null,""]
[null,"",null,""]
[null,"",null,""]
[null,"",null,""]
[null,"",null,""]
[null,"",null,""]
[null,"",null,""]
[null,"",null,""]
[null,"",null,""]
[null,"",null,""]
[null,"",null,""]
[null,"",null,""]
[null,"",null,""]
{"$rows_left_out":91}
{"sheet":"Year 4 (rename)","index":4,"n_rows":150,"n_cols":6,"rows_kept":150,"cut":false,"hidden":false,"merged":[[0,5,1,5]]}
["Farm name:","[ your farm name ]",null,"Resource consent:","[ your consent no. ]","BEFORE USING THIS SHEET:\nSet up your paddocks first on the “Record Summary” tab."]
["Season:","[ e.g. 2025-2026 ]"]
["Start Date","End Date","Paddock","Year","Calibration (Bucket Test) mm","Maintenance each month (waterblasted, greased, line couplings checked)"]
[null,{"$f":"IF($A4=\"\",\"\",$A4+9)","v":""},null,{"$f":"IF($A4=\"\",\"\",YEAR($A4))","v":""}]
[null,"",null,""]
[null,"",null,""]
[null,"",null,""]
[null,"",null,""]
[null,"",null,""]
[null,"",null,""]
[null,"",null,""]
[null,"",null,""]
[null,"",null,""]
[null,"",null,""]
[null,"",null,""]
[null,"",null,""]
[null,"",null,""]
[null,"",null,""]
[null,"",null,""]
[null,"",null,""]
[null,"",null,""]
[null,"",null,""]
[null,"",null,""]
[null,"",null,""]
[null,"",null,""]
[null,"",null,""]
[null,"",null,""]
[null,"",null,""]
[null,"",null,""]
[null,"",null,""]
[null,"",null,""]
[null,"",null,""]
[null,"",null,""]
[null,"",null,""]
[null,"",null,""]
[null,"",null,""]
[null,"",null,""]
[null,"",null,""]
[null,"",null,""]
[null,"",null,""]
[null,"",null,""]
[null,"",null,""]
[null,"",null,""]
[null,"",null,""]
[null,"",null,""]
[null,"",null,""]
[null,"",null,""]
[null,"",null,""]
[null,"",null,""]
[null,"",null,""]
[null,"",null,""]
[null,"",null,""]
[null,"",null,""]
[null,"",null,""]
[null,"",null,""]
[null,"",null,""]
[null,"",null,""]
[null,"",null,""]
[null,"",null,""]
[null,"",null,""]
{"$rows_left_out":91}
{"sheet":"Record Summary","index":5,"n_rows":250,"n_cols":4,"rows_kept":250,"cut":false,"hidden":false,"merged":[[0,0,0,1],[3,3,6,3]]}
["STEP 1 — SET UP PADDOCKS HERE FIRST  |  PADDOCK LIST & RECORD SUMMARY"]
[]
["Paddock List (edit — feeds the dropdowns)","Times applied (all seasons)"]
["Example Paddock 1",{"$f":"IF($A4=\"\",\"\",COUNTIF('Year 1 (rename)'!$C:$C,$A4)+COUNTIF('Year 2 (rename)'!$C:$C,$A4)+COUNTIF('Year 3 (rename)'!$C:$C,$A4)+COUNTIF('Year 4 (rename)'!$C:$C,$A4))","v":1},null,"Replace the example paddocks with your own (one per row). The count column adds up how many 10-day blocks each paddock received across every season tab. It is a plain tally of what you recorded — nothing here checks a rule or a limit."]
["Example Paddock 2",{"$f":"IF($A5=\"\",\"\",COUNTIF('Year 1 (rename)'!$C:$C,$A5)+COUNTIF('Year 2 (rename)'!$C:$C,$A5)+COUNTIF('Year 3 (rename)'!$C:$C,$A5)+COUNTIF('Year 4 (rename)'!$C:$C,$A5))","v":0}]
["Example Paddock 3",{"$f":"IF($A6=\"\",\"\",COUNTIF('Year 1 (rename)'!$C:$C,$A6)+COUNTIF('Year 2 (rename)'!$C:$C,$A6)+COUNTIF('Year 3 (rename)'!$C:$C,$A6)+COUNTIF('Year 4 (rename)'!$C:$C,$A6))","v":0}]
[null,{"$f":"IF($A7=\"\",\"\",COUNTIF('Year 1 (rename)'!$C:$C,$A7)+COUNTIF('Year 2 (rename)'!$C:$C,$A7)+COUNTIF('Year 3 (rename)'!$C:$C,$A7)+COUNTIF('Year 4 (rename)'!$C:$C,$A7))","v":""}]
[null,{"$f":"IF($A8=\"\",\"\",COUNTIF('Year 1 (rename)'!$C:$C,$A8)+COUNTIF('Year 2 (rename)'!$C:$C,$A8)+COUNTIF('Year 3 (rename)'!$C:$C,$A8)+COUNTIF('Year 4 (rename)'!$C:$C,$A8))","v":""}]
[null,{"$f":"IF($A9=\"\",\"\",COUNTIF('Year 1 (rename)'!$C:$C,$A9)+COUNTIF('Year 2 (rename)'!$C:$C,$A9)+COUNTIF('Year 3 (rename)'!$C:$C,$A9)+COUNTIF('Year 4 (rename)'!$C:$C,$A9))","v":""}]
[null,{"$f":"IF($A10=\"\",\"\",COUNTIF('Year 1 (rename)'!$C:$C,$A10)+COUNTIF('Year 2 (rename)'!$C:$C,$A10)+COUNTIF('Year 3 (rename)'!$C:$C,$A10)+COUNTIF('Year 4 (rename)'!$C:$C,$A10))","v":""}]
[null,{"$f":"IF($A11=\"\",\"\",COUNTIF('Year 1 (rename)'!$C:$C,$A11)+COUNTIF('Year 2 (rename)'!$C:$C,$A11)+COUNTIF('Year 3 (rename)'!$C:$C,$A11)+COUNTIF('Year 4 (rename)'!$C:$C,$A11))","v":""}]
[null,{"$f":"IF($A12=\"\",\"\",COUNTIF('Year 1 (rename)'!$C:$C,$A12)+COUNTIF('Year 2 (rename)'!$C:$C,$A12)+COUNTIF('Year 3 (rename)'!$C:$C,$A12)+COUNTIF('Year 4 (rename)'!$C:$C,$A12))","v":""}]
[null,{"$f":"IF($A13=\"\",\"\",COUNTIF('Year 1 (rename)'!$C:$C,$A13)+COUNTIF('Year 2 (rename)'!$C:$C,$A13)+COUNTIF('Year 3 (rename)'!$C:$C,$A13)+COUNTIF('Year 4 (rename)'!$C:$C,$A13))","v":""}]
[null,{"$f":"IF($A14=\"\",\"\",COUNTIF('Year 1 (rename)'!$C:$C,$A14)+COUNTIF('Year 2 (rename)'!$C:$C,$A14)+COUNTIF('Year 3 (rename)'!$C:$C,$A14)+COUNTIF('Year 4 (rename)'!$C:$C,$A14))","v":""}]
[null,{"$f":"IF($A15=\"\",\"\",COUNTIF('Year 1 (rename)'!$C:$C,$A15)+COUNTIF('Year 2 (rename)'!$C:$C,$A15)+COUNTIF('Year 3 (rename)'!$C:$C,$A15)+COUNTIF('Year 4 (rename)'!$C:$C,$A15))","v":""}]
[null,{"$f":"IF($A16=\"\",\"\",COUNTIF('Year 1 (rename)'!$C:$C,$A16)+COUNTIF('Year 2 (rename)'!$C:$C,$A16)+COUNTIF('Year 3 (rename)'!$C:$C,$A16)+COUNTIF('Year 4 (rename)'!$C:$C,$A16))","v":""}]
[null,{"$f":"IF($A17=\"\",\"\",COUNTIF('Year 1 (rename)'!$C:$C,$A17)+COUNTIF('Year 2 (rename)'!$C:$C,$A17)+COUNTIF('Year 3 (rename)'!$C:$C,$A17)+COUNTIF('Year 4 (rename)'!$C:$C,$A17))","v":""}]
[null,{"$f":"IF($A18=\"\",\"\",COUNTIF('Year 1 (rename)'!$C:$C,$A18)+COUNTIF('Year 2 (rename)'!$C:$C,$A18)+COUNTIF('Year 3 (rename)'!$C:$C,$A18)+COUNTIF('Year 4 (rename)'!$C:$C,$A18))","v":""}]
[null,{"$f":"IF($A19=\"\",\"\",COUNTIF('Year 1 (rename)'!$C:$C,$A19)+COUNTIF('Year 2 (rename)'!$C:$C,$A19)+COUNTIF('Year 3 (rename)'!$C:$C,$A19)+COUNTIF('Year 4 (rename)'!$C:$C,$A19))","v":""}]
[null,{"$f":"IF($A20=\"\",\"\",COUNTIF('Year 1 (rename)'!$C:$C,$A20)+COUNTIF('Year 2 (rename)'!$C:$C,$A20)+COUNTIF('Year 3 (rename)'!$C:$C,$A20)+COUNTIF('Year 4 (rename)'!$C:$C,$A20))","v":""}]
[null,{"$f":"IF($A21=\"\",\"\",COUNTIF('Year 1 (rename)'!$C:$C,$A21)+COUNTIF('Year 2 (rename)'!$C:$C,$A21)+COUNTIF('Year 3 (rename)'!$C:$C,$A21)+COUNTIF('Year 4 (rename)'!$C:$C,$A21))","v":""}]
[null,{"$f":"IF($A22=\"\",\"\",COUNTIF('Year 1 (rename)'!$C:$C,$A22)+COUNTIF('Year 2 (rename)'!$C:$C,$A22)+COUNTIF('Year 3 (rename)'!$C:$C,$A22)+COUNTIF('Year 4 (rename)'!$C:$C,$A22))","v":""}]
[null,{"$f":"IF($A23=\"\",\"\",COUNTIF('Year 1 (rename)'!$C:$C,$A23)+COUNTIF('Year 2 (rename)'!$C:$C,$A23)+COUNTIF('Year 3 (rename)'!$C:$C,$A23)+COUNTIF('Year 4 (rename)'!$C:$C,$A23))","v":""}]
[null,{"$f":"IF($A24=\"\",\"\",COUNTIF('Year 1 (rename)'!$C:$C,$A24)+COUNTIF('Year 2 (rename)'!$C:$C,$A24)+COUNTIF('Year 3 (rename)'!$C:$C,$A24)+COUNTIF('Year 4 (rename)'!$C:$C,$A24))","v":""}]
[null,{"$f":"IF($A25=\"\",\"\",COUNTIF('Year 1 (rename)'!$C:$C,$A25)+COUNTIF('Year 2 (rename)'!$C:$C,$A25)+COUNTIF('Year 3 (rename)'!$C:$C,$A25)+COUNTIF('Year 4 (rename)'!$C:$C,$A25))","v":""}]
[null,{"$f":"IF($A26=\"\",\"\",COUNTIF('Year 1 (rename)'!$C:$C,$A26)+COUNTIF('Year 2 (rename)'!$C:$C,$A26)+COUNTIF('Year 3 (rename)'!$C:$C,$A26)+COUNTIF('Year 4 (rename)'!$C:$C,$A26))","v":""}]
[null,{"$f":"IF($A27=\"\",\"\",COUNTIF('Year 1 (rename)'!$C:$C,$A27)+COUNTIF('Year 2 (rename)'!$C:$C,$A27)+COUNTIF('Year 3 (rename)'!$C:$C,$A27)+COUNTIF('Year 4 (rename)'!$C:$C,$A27))","v":""}]
[null,{"$f":"IF($A28=\"\",\"\",COUNTIF('Year 1 (rename)'!$C:$C,$A28)+COUNTIF('Year 2 (rename)'!$C:$C,$A28)+COUNTIF('Year 3 (rename)'!$C:$C,$A28)+COUNTIF('Year 4 (rename)'!$C:$C,$A28))","v":""}]
[null,{"$f":"IF($A29=\"\",\"\",COUNTIF('Year 1 (rename)'!$C:$C,$A29)+COUNTIF('Year 2 (rename)'!$C:$C,$A29)+COUNTIF('Year 3 (rename)'!$C:$C,$A29)+COUNTIF('Year 4 (rename)'!$C:$C,$A29))","v":""}]
[null,{"$f":"IF($A30=\"\",\"\",COUNTIF('Year 1 (rename)'!$C:$C,$A30)+COUNTIF('Year 2 (rename)'!$C:$C,$A30)+COUNTIF('Year 3 (rename)'!$C:$C,$A30)+COUNTIF('Year 4 (rename)'!$C:$C,$A30))","v":""}]
[null,{"$f":"IF($A31=\"\",\"\",COUNTIF('Year 1 (rename)'!$C:$C,$A31)+COUNTIF('Year 2 (rename)'!$C:$C,$A31)+COUNTIF('Year 3 (rename)'!$C:$C,$A31)+COUNTIF('Year 4 (rename)'!$C:$C,$A31))","v":""}]
[null,{"$f":"IF($A32=\"\",\"\",COUNTIF('Year 1 (rename)'!$C:$C,$A32)+COUNTIF('Year 2 (rename)'!$C:$C,$A32)+COUNTIF('Year 3 (rename)'!$C:$C,$A32)+COUNTIF('Year 4 (rename)'!$C:$C,$A32))","v":""}]
[null,{"$f":"IF($A33=\"\",\"\",COUNTIF('Year 1 (rename)'!$C:$C,$A33)+COUNTIF('Year 2 (rename)'!$C:$C,$A33)+COUNTIF('Year 3 (rename)'!$C:$C,$A33)+COUNTIF('Year 4 (rename)'!$C:$C,$A33))","v":""}]
[null,{"$f":"IF($A34=\"\",\"\",COUNTIF('Year 1 (rename)'!$C:$C,$A34)+COUNTIF('Year 2 (rename)'!$C:$C,$A34)+COUNTIF('Year 3 (rename)'!$C:$C,$A34)+COUNTIF('Year 4 (rename)'!$C:$C,$A34))","v":""}]
[null,{"$f":"IF($A35=\"\",\"\",COUNTIF('Year 1 (rename)'!$C:$C,$A35)+COUNTIF('Year 2 (rename)'!$C:$C,$A35)+COUNTIF('Year 3 (rename)'!$C:$C,$A35)+COUNTIF('Year 4 (rename)'!$C:$C,$A35))","v":""}]
[null,{"$f":"IF($A36=\"\",\"\",COUNTIF('Year 1 (rename)'!$C:$C,$A36)+COUNTIF('Year 2 (rename)'!$C:$C,$A36)+COUNTIF('Year 3 (rename)'!$C:$C,$A36)+COUNTIF('Year 4 (rename)'!$C:$C,$A36))","v":""}]
[null,{"$f":"IF($A37=\"\",\"\",COUNTIF('Year 1 (rename)'!$C:$C,$A37)+COUNTIF('Year 2 (rename)'!$C:$C,$A37)+COUNTIF('Year 3 (rename)'!$C:$C,$A37)+COUNTIF('Year 4 (rename)'!$C:$C,$A37))","v":""}]
[null,{"$f":"IF($A38=\"\",\"\",COUNTIF('Year 1 (rename)'!$C:$C,$A38)+COUNTIF('Year 2 (rename)'!$C:$C,$A38)+COUNTIF('Year 3 (rename)'!$C:$C,$A38)+COUNTIF('Year 4 (rename)'!$C:$C,$A38))","v":""}]
[null,{"$f":"IF($A39=\"\",\"\",COUNTIF('Year 1 (rename)'!$C:$C,$A39)+COUNTIF('Year 2 (rename)'!$C:$C,$A39)+COUNTIF('Year 3 (rename)'!$C:$C,$A39)+COUNTIF('Year 4 (rename)'!$C:$C,$A39))","v":""}]
[null,{"$f":"IF($A40=\"\",\"\",COUNTIF('Year 1 (rename)'!$C:$C,$A40)+COUNTIF('Year 2 (rename)'!$C:$C,$A40)+COUNTIF('Year 3 (rename)'!$C:$C,$A40)+COUNTIF('Year 4 (rename)'!$C:$C,$A40))","v":""}]
[null,{"$f":"IF($A41=\"\",\"\",COUNTIF('Year 1 (rename)'!$C:$C,$A41)+COUNTIF('Year 2 (rename)'!$C:$C,$A41)+COUNTIF('Year 3 (rename)'!$C:$C,$A41)+COUNTIF('Year 4 (rename)'!$C:$C,$A41))","v":""}]
[null,{"$f":"IF($A42=\"\",\"\",COUNTIF('Year 1 (rename)'!$C:$C,$A42)+COUNTIF('Year 2 (rename)'!$C:$C,$A42)+COUNTIF('Year 3 (rename)'!$C:$C,$A42)+COUNTIF('Year 4 (rename)'!$C:$C,$A42))","v":""}]
[null,{"$f":"IF($A43=\"\",\"\",COUNTIF('Year 1 (rename)'!$C:$C,$A43)+COUNTIF('Year 2 (rename)'!$C:$C,$A43)+COUNTIF('Year 3 (rename)'!$C:$C,$A43)+COUNTIF('Year 4 (rename)'!$C:$C,$A43))","v":""}]
[null,{"$f":"IF($A44=\"\",\"\",COUNTIF('Year 1 (rename)'!$C:$C,$A44)+COUNTIF('Year 2 (rename)'!$C:$C,$A44)+COUNTIF('Year 3 (rename)'!$C:$C,$A44)+COUNTIF('Year 4 (rename)'!$C:$C,$A44))","v":""}]
[null,{"$f":"IF($A45=\"\",\"\",COUNTIF('Year 1 (rename)'!$C:$C,$A45)+COUNTIF('Year 2 (rename)'!$C:$C,$A45)+COUNTIF('Year 3 (rename)'!$C:$C,$A45)+COUNTIF('Year 4 (rename)'!$C:$C,$A45))","v":""}]
[null,{"$f":"IF($A46=\"\",\"\",COUNTIF('Year 1 (rename)'!$C:$C,$A46)+COUNTIF('Year 2 (rename)'!$C:$C,$A46)+COUNTIF('Year 3 (rename)'!$C:$C,$A46)+COUNTIF('Year 4 (rename)'!$C:$C,$A46))","v":""}]
[null,{"$f":"IF($A47=\"\",\"\",COUNTIF('Year 1 (rename)'!$C:$C,$A47)+COUNTIF('Year 2 (rename)'!$C:$C,$A47)+COUNTIF('Year 3 (rename)'!$C:$C,$A47)+COUNTIF('Year 4 (rename)'!$C:$C,$A47))","v":""}]
[null,{"$f":"IF($A48=\"\",\"\",COUNTIF('Year 1 (rename)'!$C:$C,$A48)+COUNTIF('Year 2 (rename)'!$C:$C,$A48)+COUNTIF('Year 3 (rename)'!$C:$C,$A48)+COUNTIF('Year 4 (rename)'!$C:$C,$A48))","v":""}]
[null,{"$f":"IF($A49=\"\",\"\",COUNTIF('Year 1 (rename)'!$C:$C,$A49)+COUNTIF('Year 2 (rename)'!$C:$C,$A49)+COUNTIF('Year 3 (rename)'!$C:$C,$A49)+COUNTIF('Year 4 (rename)'!$C:$C,$A49))","v":""}]
[null,{"$f":"IF($A50=\"\",\"\",COUNTIF('Year 1 (rename)'!$C:$C,$A50)+COUNTIF('Year 2 (rename)'!$C:$C,$A50)+COUNTIF('Year 3 (rename)'!$C:$C,$A50)+COUNTIF('Year 4 (rename)'!$C:$C,$A50))","v":""}]
[null,{"$f":"IF($A51=\"\",\"\",COUNTIF('Year 1 (rename)'!$C:$C,$A51)+COUNTIF('Year 2 (rename)'!$C:$C,$A51)+COUNTIF('Year 3 (rename)'!$C:$C,$A51)+COUNTIF('Year 4 (rename)'!$C:$C,$A51))","v":""}]
[null,{"$f":"IF($A52=\"\",\"\",COUNTIF('Year 1 (rename)'!$C:$C,$A52)+COUNTIF('Year 2 (rename)'!$C:$C,$A52)+COUNTIF('Year 3 (rename)'!$C:$C,$A52)+COUNTIF('Year 4 (rename)'!$C:$C,$A52))","v":""}]
[null,{"$f":"IF($A53=\"\",\"\",COUNTIF('Year 1 (rename)'!$C:$C,$A53)+COUNTIF('Year 2 (rename)'!$C:$C,$A53)+COUNTIF('Year 3 (rename)'!$C:$C,$A53)+COUNTIF('Year 4 (rename)'!$C:$C,$A53))","v":""}]
[null,{"$f":"IF($A54=\"\",\"\",COUNTIF('Year 1 (rename)'!$C:$C,$A54)+COUNTIF('Year 2 (rename)'!$C:$C,$A54)+COUNTIF('Year 3 (rename)'!$C:$C,$A54)+COUNTIF('Year 4 (rename)'!$C:$C,$A54))","v":""}]
[null,{"$f":"IF($A55=\"\",\"\",COUNTIF('Year 1 (rename)'!$C:$C,$A55)+COUNTIF('Year 2 (rename)'!$C:$C,$A55)+COUNTIF('Year 3 (rename)'!$C:$C,$A55)+COUNTIF('Year 4 (rename)'!$C:$C,$A55))","v":""}]
[null,{"$f":"IF($A56=\"\",\"\",COUNTIF('Year 1 (rename)'!$C:$C,$A56)+COUNTIF('Year 2 (rename)'!$C:$C,$A56)+COUNTIF('Year 3 (rename)'!$C:$C,$A56)+COUNTIF('Year 4 (rename)'!$C:$C,$A56))","v":""}]
[null,{"$f":"IF($A57=\"\",\"\",COUNTIF('Year 1 (rename)'!$C:$C,$A57)+COUNTIF('Year 2 (rename)'!$C:$C,$A57)+COUNTIF('Year 3 (rename)'!$C:$C,$A57)+COUNTIF('Year 4 (rename)'!$C:$C,$A57))","v":""}]
[null,{"$f":"IF($A58=\"\",\"\",COUNTIF('Year 1 (rename)'!$C:$C,$A58)+COUNTIF('Year 2 (rename)'!$C:$C,$A58)+COUNTIF('Year 3 (rename)'!$C:$C,$A58)+COUNTIF('Year 4 (rename)'!$C:$C,$A58))","v":""}]
[null,{"$f":"IF($A59=\"\",\"\",COUNTIF('Year 1 (rename)'!$C:$C,$A59)+COUNTIF('Year 2 (rename)'!$C:$C,$A59)+COUNTIF('Year 3 (rename)'!$C:$C,$A59)+COUNTIF('Year 4 (rename)'!$C:$C,$A59))","v":""}]
[null,{"$f":"IF($A60=\"\",\"\",COUNTIF('Year 1 (rename)'!$C:$C,$A60)+COUNTIF('Year 2 (rename)'!$C:$C,$A60)+COUNTIF('Year 3 (rename)'!$C:$C,$A60)+COUNTIF('Year 4 (rename)'!$C:$C,$A60))","v":""}]
{"$rows_left_out":190}